ObstacleArea-surfaceExtent
type: ObjectProperty
sub property of: ObstacleArea OP
domain: ObstacleArea
comment: Association to Geometry::Surface

ObstacleAreaOrigin-CHOICE
type: ObjectProperty
sub property of: ObstacleAreaOrigin OP
domain: ObstacleAreaOrigin
comment: Includes associations (choice) to Organisation::OrganisationAuthority, AirportHeliport::Airport/Heliport::AirportHeliport and AirportHeliport::Runway::Runway

ObstacleAreaOrigin-ownerAirport
type: ObjectProperty
sub property of: ObstacleAreaOrigin-CHOICE
comment: Association to AirportHeliport::Airport/Heliport::AirportHeliport

ObstacleAreaOrigin-ownerOrganisation
type: ObjectProperty
sub property of: ObstacleAreaOrigin-CHOICE
comment: Association to Organisation::OrganisationAuthority

ObstacleAreaOrigin-ownerRunway
type: ObjectProperty
sub property of: ObstacleAreaOrigin-CHOICE
comment: Association to AirportHeliport::Runway::Runway

VerticalStructure-hostedOrganisation
type: ObjectProperty
sub property of: VerticalStructure OP
domain: VerticalStructure
comment: Association to Organisation::OrganisationAuthority

VerticalStructure-hostedUnit
type: ObjectProperty
sub property of: VerticalStructure OP
domain: VerticalStructure
comment: Association to Organisation::Unit

VerticalStructure-supportedGroundLight
type: ObjectProperty
sub property of: VerticalStructure OP
domain: VerticalStructure
comment: Association to AirportHeliport::Lighting::GroundLightSystem

VerticalStructurePart-lighting
type: ObjectProperty
sub property of: VerticalStructurePart OP
domain: VerticalStructurePart
comment: Association to Shared::Light Element::LightElement

VerticalStructurePartGeometry-linearExtent
type: ObjectProperty
sub property of: VerticalStructurePartGeometry OP
domain: VerticalStructurePartGeometry
comment: Association to Geometry::ElevatedCurve

VerticalStructurePartGeometry-location
type: ObjectProperty
sub property of: VerticalStructurePartGeometry OP
domain: VerticalStructurePartGeometry
comment: Association to Geometry::ElevatedPoint

VerticalStructurePartGeometry-surfaceExtent
type: ObjectProperty
sub property of: VerticalStructurePartGeometry OP
domain: VerticalStructurePartGeometry
comment: Association to Geometry::ElevatedSurface

AIXMDataTypes
type: Class
comment: The complex datatypes used by AIXM are changed to simple data types, so only the codelists are represented within the _AIXMDataTypes_ package/class.